{"text_format":"3","workbook":"xlsx","n_sheets":2,"sheets":["Calculatie","Producten"],"not_rendered":{"images":3,"macros":1,"defined_names":6},"read":"whole","date_system":"1900"}

{"sheet":"Calculatie","index":0,"n_rows":57,"n_cols":17,"rows_kept":57,"merged":[[2,2,2,3],[2,7,2,8],[2,15,2,16],[3,2,3,3],[3,7,3,8],[4,7,4,8],[5,2,5,4],[5,7,5,8],[6,2,6,3],[6,7,6,8],[8,3,8,4],[9,3,9,4],[10,3,10,4],[11,3,11,4],[12,3,12,4],[13,3,13,4],[14,3,14,4],[15,3,15,4],[16,3,16,4],[17,3,17,4],[18,3,18,4],[19,3,19,4],[20,3,20,4],[21,3,21,4],[22,3,22,4],[23,3,23,4],[24,3,24,4],[25,3,25,4],[26,3,26,4],[27,3,27,4],[28,3,28,4],[29,3,29,4],[30,3,30,4],[31,3,31,4],[32,3,32,4],[33,3,33,4],[34,3,34,4],[35,3,35,4],[36,3,36,4],[37,3,37,4],[38,3,38,4],[39,3,39,4],[40,3,40,4],[41,3,41,4],[42,3,42,4],[43,3,43,4],[58,3,58,4]]}
[]
[]
[null,null,"Kandidaatnaam:",{"$nulls":4},"korting op materiaal",{"$nulls":7},{"$f":"ISERROR(I46)","v":false}]
[null,null,"Kandidaatnummer:",{"$nulls":4},"opslag voor materiaalverlies"]
[{"$nulls":7},"uurtarief arbeid"]
[null,null,"Druk op start om te beginnen.",{"$nulls":4},"btw materiaal"]
[null,null,"productgroep:",{"$nulls":4},"btw arbeidsloon"]
[{"$nulls":15},"productgroep","omschrijving"]
[{"$nulls":3},"materiaalomschrijving",null,"aantal","prijs per stuk of meter","totaal prijs\nmateriaal","arbeid","totaal arbeid",{"$nulls":5},"aardingsmateriaal"]
[null,null,1,{"$nulls":3},{"$f":"IF(D10=\"\",\"\",VLOOKUP($D10,Producten!$B:$D,3,FALSE))","v":""},{"$f":"IF(D10=\"\",\"\",F10*G10)","v":""},{"$f":"IF(D10=\"\",\"\",VLOOKUP($D10,Producten!$B:$F,4,FALSE))","v":""},{"$f":"IF(D10=\"\",\"\",I10*F10)","v":""},{"$nulls":5},"automaten"]
[null,null,2,{"$nulls":3},{"$f":"IF(D11=\"\",\"\",VLOOKUP($D11,Producten!$B:$D,3,FALSE))","v":""},{"$f":"IF(D11=\"\",\"\",F11*G11)","v":""},{"$f":"IF(D11=\"\",\"\",VLOOKUP($D11,Producten!$B:$F,4,FALSE))","v":""},{"$f":"IF(D11=\"\",\"\",I11*F11)","v":""},{"$nulls":5},"bevestigingsmaterialen"]
[null,null,3,{"$nulls":3},{"$f":"IF(D12=\"\",\"\",VLOOKUP($D12,Producten!$B:$D,3,FALSE))","v":""},"",{"$f":"IF(D12=\"\",\"\",VLOOKUP($D12,Producten!$B:$F,4,FALSE))","v":""},"",{"$nulls":5},"CEE-materiaal"]
[null,null,4,{"$nulls":3},{"$f":"IF(D13=\"\",\"\",VLOOKUP($D13,Producten!$B:$D,3,FALSE))","v":""},"",{"$f":"IF(D13=\"\",\"\",VLOOKUP($D13,Producten!$B:$F,4,FALSE))","v":""},"",{"$nulls":5},"diversen"]
[null,null,5,{"$nulls":3},{"$f":"IF(D14=\"\",\"\",VLOOKUP($D14,Producten!$B:$D,3,FALSE))","v":""},"",{"$f":"IF(D14=\"\",\"\",VLOOKUP($D14,Producten!$B:$F,4,FALSE))","v":""},"",{"$nulls":5},"dozen"]
[null,null,6,{"$nulls":3},{"$f":"IF(D15=\"\",\"\",VLOOKUP($D15,Producten!$B:$D,3,FALSE))","v":""},"",{"$f":"IF(D15=\"\",\"\",VLOOKUP($D15,Producten!$B:$F,4,FALSE))","v":""},"",{"$nulls":5},"draad en kabel"]
[null,null,7,{"$nulls":3},{"$f":"IF(D16=\"\",\"\",VLOOKUP($D16,Producten!$B:$D,3,FALSE))","v":""},"",{"$f":"IF(D16=\"\",\"\",VLOOKUP($D16,Producten!$B:$F,4,FALSE))","v":""},"",{"$nulls":5},"groepenkast"]
[null,null,8,{"$nulls":3},{"$f":"IF(D17=\"\",\"\",VLOOKUP($D17,Producten!$B:$D,3,FALSE))","v":""},"",{"$f":"IF(D17=\"\",\"\",VLOOKUP($D17,Producten!$B:$F,4,FALSE))","v":""},"",{"$nulls":5},"installatiebuis"]
[null,null,9,{"$nulls":3},{"$f":"IF(D18=\"\",\"\",VLOOKUP($D18,Producten!$B:$D,3,FALSE))","v":""},"",{"$f":"IF(D18=\"\",\"\",VLOOKUP($D18,Producten!$B:$F,4,FALSE))","v":""},"",{"$nulls":5},"kabelgoot"]
[null,null,10,{"$nulls":3},{"$f":"IF(D19=\"\",\"\",VLOOKUP($D19,Producten!$B:$D,3,FALSE))","v":""},"",{"$f":"IF(D19=\"\",\"\",VLOOKUP($D19,Producten!$B:$F,4,FALSE))","v":""},"",{"$nulls":5},"kunststofkasten"]
[null,null,11,{"$nulls":3},{"$f":"IF(D20=\"\",\"\",VLOOKUP($D20,Producten!$B:$D,3,FALSE))","v":""},"",{"$f":"IF(D20=\"\",\"\",VLOOKUP($D20,Producten!$B:$F,4,FALSE))","v":""},"",{"$nulls":5},"pakkingbussen en moeren"]
[null,null,12,{"$nulls":3},{"$f":"IF(D21=\"\",\"\",VLOOKUP($D21,Producten!$B:$D,3,FALSE))","v":""},"",{"$f":"IF(D21=\"\",\"\",VLOOKUP($D21,Producten!$B:$F,4,FALSE))","v":""},"",{"$nulls":5},"plattebuissysteem 25 mm"]
[null,null,13,{"$nulls":3},{"$f":"IF(D22=\"\",\"\",VLOOKUP($D22,Producten!$B:$D,3,FALSE))","v":""},"",{"$f":"IF(D22=\"\",\"\",VLOOKUP($D22,Producten!$B:$F,4,FALSE))","v":""},"",{"$nulls":5},"plintsysteem 70 mm"]
[null,null,14,{"$nulls":3},{"$f":"IF(D23=\"\",\"\",VLOOKUP($D23,Producten!$B:$D,3,FALSE))","v":""},"",{"$f":"IF(D23=\"\",\"\",VLOOKUP($D23,Producten!$B:$F,4,FALSE))","v":""},"",{"$nulls":5},"relais- en magneetschakelaars"]
[null,null,15,{"$nulls":3},{"$f":"IF(D24=\"\",\"\",VLOOKUP($D24,Producten!$B:$D,3,FALSE))","v":""},"",{"$f":"IF(D24=\"\",\"\",VLOOKUP($D24,Producten!$B:$F,4,FALSE))","v":""},"",{"$nulls":5},"rijgklemmen"]
[null,null,16,{"$nulls":3},{"$f":"IF(D25=\"\",\"\",VLOOKUP($D25,Producten!$B:$D,3,FALSE))","v":""},"",{"$f":"IF(D25=\"\",\"\",VLOOKUP($D25,Producten!$B:$F,4,FALSE))","v":""},"",{"$nulls":5},"schakelmateriaal inbouw"]
[null,null,17,{"$nulls":3},{"$f":"IF(D26=\"\",\"\",VLOOKUP($D26,Producten!$B:$D,3,FALSE))","v":""},"",{"$f":"IF(D26=\"\",\"\",VLOOKUP($D26,Producten!$B:$F,4,FALSE))","v":""},"",{"$nulls":5},"schakelmateriaal opbouw"]
[null,null,18,{"$nulls":3},{"$f":"IF(D27=\"\",\"\",VLOOKUP($D27,Producten!$B:$D,3,FALSE))","v":""},"",{"$f":"IF(D27=\"\",\"\",VLOOKUP($D27,Producten!$B:$F,4,FALSE))","v":""},"",{"$nulls":5},"schakelmateriaal spatwaterdicht"]
[null,null,19,{"$nulls":3},{"$f":"IF(D28=\"\",\"\",VLOOKUP($D28,Producten!$B:$D,3,FALSE))","v":""},"",{"$f":"IF(D28=\"\",\"\",VLOOKUP($D28,Producten!$B:$F,4,FALSE))","v":""},"",{"$nulls":5},"sensoren"]
[null,null,20,{"$nulls":3},{"$f":"IF(D29=\"\",\"\",VLOOKUP($D29,Producten!$B:$D,3,FALSE))","v":""},"",{"$f":"IF(D29=\"\",\"\",VLOOKUP($D29,Producten!$B:$F,4,FALSE))","v":""},"",{"$nulls":5},"signaalkasten/signaalgevers"]
[null,null,21,{"$nulls":3},{"$f":"IF(D30=\"\",\"\",VLOOKUP($D30,Producten!$B:$D,3,FALSE))","v":""},"",{"$f":"IF(D30=\"\",\"\",VLOOKUP($D30,Producten!$B:$F,4,FALSE))","v":""},"",{"$nulls":5},"verlichting en armaturen"]
[null,null,22,{"$nulls":3},{"$f":"IF(D31=\"\",\"\",VLOOKUP($D31,Producten!$B:$D,3,FALSE))","v":""},"",{"$f":"IF(D31=\"\",\"\",VLOOKUP($D31,Producten!$B:$F,4,FALSE))","v":""},""]
[null,null,23,{"$nulls":3},{"$f":"IF(D32=\"\",\"\",VLOOKUP($D32,Producten!$B:$D,3,FALSE))","v":""},"",{"$f":"IF(D32=\"\",\"\",VLOOKUP($D32,Producten!$B:$F,4,FALSE))","v":""},""]
[null,null,24,{"$nulls":3},{"$f":"IF(D33=\"\",\"\",VLOOKUP($D33,Producten!$B:$D,3,FALSE))","v":""},"",{"$f":"IF(D33=\"\",\"\",VLOOKUP($D33,Producten!$B:$F,4,FALSE))","v":""},""]
[null,null,25,{"$nulls":3},{"$f":"IF(D34=\"\",\"\",VLOOKUP($D34,Producten!$B:$D,3,FALSE))","v":""},"",{"$f":"IF(D34=\"\",\"\",VLOOKUP($D34,Producten!$B:$F,4,FALSE))","v":""},""]
[null,null,26,{"$nulls":3},{"$f":"IF(D35=\"\",\"\",VLOOKUP($D35,Producten!$B:$D,3,FALSE))","v":""},"",{"$f":"IF(D35=\"\",\"\",VLOOKUP($D35,Producten!$B:$F,4,FALSE))","v":""},""]
[null,null,27,{"$nulls":3},{"$f":"IF(D36=\"\",\"\",VLOOKUP($D36,Producten!$B:$D,3,FALSE))","v":""},"",{"$f":"IF(D36=\"\",\"\",VLOOKUP($D36,Producten!$B:$F,4,FALSE))","v":""},""]
[null,null,28,{"$nulls":3},{"$f":"IF(D37=\"\",\"\",VLOOKUP($D37,Producten!$B:$D,3,FALSE))","v":""},"",{"$f":"IF(D37=\"\",\"\",VLOOKUP($D37,Producten!$B:$F,4,FALSE))","v":""},""]
[null,null,29,{"$nulls":3},{"$f":"IF(D38=\"\",\"\",VLOOKUP($D38,Producten!$B:$D,3,FALSE))","v":""},"",{"$f":"IF(D38=\"\",\"\",VLOOKUP($D38,Producten!$B:$F,4,FALSE))","v":""},""]
[null,null,30,{"$nulls":3},{"$f":"IF(D39=\"\",\"\",VLOOKUP($D39,Producten!$B:$D,3,FALSE))","v":""},"",{"$f":"IF(D39=\"\",\"\",VLOOKUP($D39,Producten!$B:$F,4,FALSE))","v":""},""]
[null,null,31,{"$nulls":3},{"$f":"IF(D40=\"\",\"\",VLOOKUP($D40,Producten!$B:$D,3,FALSE))","v":""},"",{"$f":"IF(D40=\"\",\"\",VLOOKUP($D40,Producten!$B:$F,4,FALSE))","v":""},""]
[null,null,32,{"$nulls":3},{"$f":"IF(D41=\"\",\"\",VLOOKUP($D41,Producten!$B:$D,3,FALSE))","v":""},"",{"$f":"IF(D41=\"\",\"\",VLOOKUP($D41,Producten!$B:$F,4,FALSE))","v":""},""]
[null,null,33,{"$nulls":3},{"$f":"IF(D42=\"\",\"\",VLOOKUP($D42,Producten!$B:$D,3,FALSE))","v":""},"",{"$f":"IF(D42=\"\",\"\",VLOOKUP($D42,Producten!$B:$F,4,FALSE))","v":""},""]
[null,null,34,{"$nulls":3},{"$f":"IF(D43=\"\",\"\",VLOOKUP($D43,Producten!$B:$D,3,FALSE))","v":""},"",{"$f":"IF(D43=\"\",\"\",VLOOKUP($D43,Producten!$B:$F,4,FALSE))","v":""},""]
[null,null,35,{"$nulls":3},{"$f":"IF(D44=\"\",\"\",VLOOKUP($D44,Producten!$B:$D,3,FALSE))","v":""},"",{"$f":"IF(D44=\"\",\"\",VLOOKUP($D44,Producten!$B:$F,4,FALSE))","v":""},""]
[]
[{"$nulls":7},"netto materiaalkosten",{"$f":"SUM(H10:H44)","v":0}]
[{"$nulls":7},"korting op materiaal",{"$f":"I46*$J$3","v":0}]
[{"$nulls":7},"opslag voor materiaalverlies",{"$f":"I46*$J$4","v":0}]
[{"$nulls":7},"btw materiaal",{"$f":"$J$6*(I46-I47+I48)","v":0}]
[{"$nulls":7},"materiaalkosten inclusief btw",null,{"$f":"I46-I47+I48+I49","v":0}]
[]
[{"$nulls":7},"aantal uren arbeid",{"$f":"SUM(J10:J44)","v":{"v":0,"d":"0.00"}}]
[{"$nulls":7},"arbeidsloon exclusief btw",{"$f":"I52*$J$5","v":0}]
[{"$nulls":7},"btw arbeidsloon",{"$f":"$J$7*I53","v":0}]
[{"$nulls":7},"arbeid inclusief btw",null,{"$f":"I53+I54","v":0}]
[]
[{"$nulls":7},"totale kosten installatie inclusief btw",null,{"$f":"J50+J55","v":0}]

{"sheet":"Producten","index":1,"n_rows":454,"n_cols":8,"rows_kept":454}
["Productgroep","omschrijving","artikelnr","prijs in €","arbeidsfactor","korting %","uitvoering","leverancier"]
["aardingsmateriaal","aardmat 1 m²",{"v":10010100,"d":"10,010,100"},17.58,{"v":0.2,"d":"0.200"},{"v":0.35,"d":"35%"},null,"Install-Tech"]
["aardingsmateriaal","badkameraardingsrail (CAP), vernikkeld",{"$f":"C2+3","v":{"v":10010103,"d":"10,010,103"}},4.12,{"v":0.2,"d":"0.200"},{"v":0.35,"d":"35%"},null,"Install-Tech"]
["aardingsmateriaal","BC 25 mm²",{"v":10010106,"d":"10,010,106"},4.23,{"v":0.3,"d":"0.300"},{"v":0.35,"d":"35%"},null,"Install-Tech"]
["aardingsmateriaal","BC 4 mm²",{"v":10010109,"d":"10,010,109"},0.68,{"v":0.2,"d":"0.200"},{"v":0.35,"d":"35%"},null,"Install-Tech"]
["aardingsmateriaal","BC 6 mm²",{"v":10010112,"d":"10,010,112"},1.05,{"v":0.2,"d":"0.200"},{"v":0.35,"d":"35%"},null,"Install-Tech"]
["aardingsmateriaal","buisklem 10 - 12 mm",{"v":10010115,"d":"10,010,115"},3.02,{"v":0.2,"d":"0.200"},{"v":0.35,"d":"35%"},null,"Install-Tech"]
["aardingsmateriaal","buisklem 13 - 15 mm",{"v":10010118,"d":"10,010,118"},3.23,{"v":0.2,"d":"0.200"},{"v":0.35,"d":"35%"},null,"Install-Tech"]
["aardingsmateriaal","buisklem 16 - 17 mm",{"v":10010121,"d":"10,010,121"},3.39,{"v":0.2,"d":"0.200"},{"v":0.35,"d":"35%"},null,"Install-Tech"]
["aardingsmateriaal","buisklem 21 - 22 mm",{"v":10010124,"d":"10,010,124"},3.75,{"v":0.2,"d":"0.200"},{"v":0.35,"d":"35%"},null,"Install-Tech"]
["aardingsmateriaal","hoofdaardrail",{"v":10010127,"d":"10,010,127"},{"v":7.2,"d":"7.20"},{"v":0.2,"d":"0.200"},{"v":0.35,"d":"35%"},null,"Install-Tech"]
["aardingsmateriaal","radiatorklem",{"v":10010130,"d":"10,010,130"},2.83,{"v":0.2,"d":"0.200"},{"v":0.35,"d":"35%"},null,"Install-Tech"]
["automaten","aardlekautomaat 16 A 2-polig, 30 mA",{"v":10020100,"d":"10,020,100"},128.87,{"v":0.25,"d":"0.250"},{"v":0.35,"d":"35%"},null,"Install-Tech"]
["automaten","aardlekautomaat 40 A 4-polig, 30 mA",{"$f":"C13+3","v":{"v":10020103,"d":"10,020,103"}},192.72,{"v":0.25,"d":"0.250"},{"v":0.35,"d":"35%"},null,"Install-Tech"]
["automaten","aardlekschakelaar 30 mA, 2-polig",{"v":10020106,"d":"10,020,106"},{"v":126,"d":"126.00"},{"v":0.25,"d":"0.250"},{"v":0.35,"d":"35%"},null,"Install-Tech"]
["automaten","aardlekschakelaar 30 mA, 4-polig",{"v":10020109,"d":"10,020,109"},{"v":172,"d":"172.00"},{"v":0.25,"d":"0.250"},{"v":0.35,"d":"35%"},null,"Install-Tech"]
["automaten","fornuisgroep 1-fase 16 A  ",{"v":10020112,"d":"10,020,112"},57.71,{"v":0.2,"d":"0.200"},{"v":0.35,"d":"35%"},null,"Install-Tech"]
["automaten","installatie-automaat 1 polig + N, 10 A",{"v":10020115,"d":"10,020,115"},{"v":35.7,"d":"35.70"},{"v":0.2,"d":"0.200"},{"v":0.35,"d":"35%"},null,"Install-Tech"]
["automaten","installatie-automaat 1 polig + N, 16 A",{"v":10020118,"d":"10,020,118"},{"v":33.8,"d":"33.80"},{"v":0.2,"d":"0.200"},{"v":0.35,"d":"35%"},null,"Install-Tech"]
["automaten","installatie-automaat 1 polig + N, 20 A",{"v":10020121,"d":"10,020,121"},{"v":35.7,"d":"35.70"},{"v":0.2,"d":"0.200"},{"v":0.35,"d":"35%"},null,"Install-Tech"]
["bevestigingsmaterialen","beugel, staal, 16 mm",{"v":10030100,"d":"10,030,100"},0.04,{"v":0,"d":"0.000"},{"v":0.35,"d":"35%"},null,"Install-Tech"]
["bevestigingsmaterialen","beugel, staal, 19 mm",{"$f":"C21+3","v":{"v":10030103,"d":"10,030,103"}},0.05,{"v":0,"d":"0.000"},{"v":0.35,"d":"35%"},null,"Install-Tech"]
["bevestigingsmaterialen","bevestigingsmaterialen (set)",{"v":10030101,"d":"10,030,101"},8.46,{"v":0,"d":"0.000"},{"v":0.35,"d":"35%"},null,"Install-Tech"]
["bevestigingsmaterialen","kabelzadel  5...14 mm",{"$f":"C23+3","v":{"v":10030104,"d":"10,030,104"}},0.33,{"v":0,"d":"0.000"},{"v":0.35,"d":"35%"},null,"Install-Tech"]
["bevestigingsmaterialen","kabelzadel  6...17 mm",{"v":10030107,"d":"10,030,107"},0.26,{"v":0,"d":"0.000"},{"v":0.35,"d":"35%"},null,"Install-Tech"]
["bevestigingsmaterialen","kabelzadel 15…25 mm",{"v":10030110,"d":"10,030,110"},1.07,{"v":0,"d":"0.000"},{"v":0.35,"d":"35%"},null,"Install-Tech"]
["bevestigingsmaterialen","klembeugel  16...19 mm",{"v":10030113,"d":"10,030,113"},0.36,{"v":0,"d":"0.000"},{"v":0.35,"d":"35%"},null,"Install-Tech"]
["bevestigingsmaterialen","klembeugel  19… 22 mm",{"v":10030116,"d":"10,030,116"},0.39,{"v":0,"d":"0.000"},{"v":0.35,"d":"35%"},null,"Install-Tech"]
["bevestigingsmaterialen","metaalschroef clinderkop gegalv. M3 x 10",{"v":10030119,"d":"10,030,119"},{"v":0.016,"d":"0.02"},{"v":0,"d":"0.000"},{"v":0.35,"d":"35%"},null,"Install-Tech"]
["bevestigingsmaterialen","metaalschroef clinderkop gegalv. M3 x 12",{"v":10030122,"d":"10,030,122"},{"v":0.017,"d":"0.02"},{"v":0,"d":"0.000"},{"v":0.35,"d":"35%"},null,"Install-Tech"]
["bevestigingsmaterialen","metaalschroef clinderkop gegalv. M3 x 16",{"v":10030125,"d":"10,030,125"},{"v":0.014,"d":"0.01"},{"v":0,"d":"0.000"},{"v":0.35,"d":"35%"},null,"Install-Tech"]
["bevestigingsmaterialen","metaalschroef clinderkop gegalv. M3 x 20",{"v":10030128,"d":"10,030,128"},{"v":0.015,"d":"0.02"},{"v":0,"d":"0.000"},{"v":0.35,"d":"35%"},null,"Install-Tech"]
["bevestigingsmaterialen","metaalschroef clinderkop gegalv. M3 x 25",{"v":10030131,"d":"10,030,131"},{"v":0.018,"d":"0.02"},{"v":0,"d":"0.000"},{"v":0.35,"d":"35%"},null,"Install-Tech"]
["bevestigingsmaterialen","metaalschroef clinderkop gegalv. M3 x 30",{"v":10030134,"d":"10,030,134"},{"v":0.032,"d":"0.03"},{"v":0,"d":"0.000"},{"v":0.35,"d":"35%"},null,"Install-Tech"]
["bevestigingsmaterialen","metaalschroef clinderkop gegalv. M4 x 10",{"v":10030137,"d":"10,030,137"},{"v":0.021,"d":"0.02"},{"v":0,"d":"0.000"},{"v":0.35,"d":"35%"},null,"Install-Tech"]
["bevestigingsmaterialen","metaalschroef clinderkop gegalv. M4 x 12",{"v":10030140,"d":"10,030,140"},{"v":0.021,"d":"0.02"},{"v":0,"d":"0.000"},{"v":0.35,"d":"35%"},null,"Install-Tech"]
["bevestigingsmaterialen","metaalschroef clinderkop gegalv. M4 x 16",{"v":10030143,"d":"10,030,143"},{"v":0.025,"d":"0.03"},{"v":0,"d":"0.000"},{"v":0.35,"d":"35%"},null,"Install-Tech"]
["bevestigingsmaterialen","metaalschroef clinderkop gegalv. M4 x 20",{"v":10030146,"d":"10,030,146"},{"v":0.029,"d":"0.03"},{"v":0,"d":"0.000"},{"v":0.35,"d":"35%"},null,"Install-Tech"]
["bevestigingsmaterialen","metaalschroef clinderkop gegalv. M4 x 25",{"v":10030149,"d":"10,030,149"},{"v":0.034,"d":"0.03"},{"v":0,"d":"0.000"},{"v":0.35,"d":"35%"},null,"Install-Tech"]
["bevestigingsmaterialen","metaalschroef clinderkop gegalv. M4 x 30",{"v":10030152,"d":"10,030,152"},{"v":0.038,"d":"0.04"},{"v":0,"d":"0.000"},{"v":0.35,"d":"35%"},null,"Install-Tech"]
["bevestigingsmaterialen","metaalschroef platkop gegalv. M3 x 10",{"v":10030155,"d":"10,030,155"},{"v":0.019,"d":"0.02"},{"v":0,"d":"0.000"},{"v":0.35,"d":"35%"},null,"Install-Tech"]
["bevestigingsmaterialen","metaalschroef platkop gegalv. M3 x 12",{"v":10030158,"d":"10,030,158"},{"v":0.021,"d":"0.02"},{"v":0,"d":"0.000"},{"v":0.35,"d":"35%"},null,"Install-Tech"]
["bevestigingsmaterialen","metaalschroef platkop gegalv. M3 x 16",{"v":10030161,"d":"10,030,161"},{"v":0.021,"d":"0.02"},{"v":0,"d":"0.000"},{"v":0.35,"d":"35%"},null,"Install-Tech"]
["bevestigingsmaterialen","metaalschroef platkop gegalv. M3 x 20",{"v":10030164,"d":"10,030,164"},{"v":0.022,"d":"0.02"},{"v":0,"d":"0.000"},{"v":0.35,"d":"35%"},null,"Install-Tech"]
["bevestigingsmaterialen","metaalschroef platkop gegalv. M3 x 25",{"v":10030167,"d":"10,030,167"},{"v":0.025,"d":"0.03"},{"v":0,"d":"0.000"},{"v":0.35,"d":"35%"},null,"Install-Tech"]
["bevestigingsmaterialen","metaalschroef platkop gegalv. M3 x 30",{"v":10030170,"d":"10,030,170"},{"v":0.034,"d":"0.03"},{"v":0,"d":"0.000"},{"v":0.35,"d":"35%"},null,"Install-Tech"]
["bevestigingsmaterialen","rijg-drukzadel   6...13 mm",{"v":10030173,"d":"10,030,173"},0.32,{"v":0,"d":"0.000"},{"v":0.35,"d":"35%"},null,"Install-Tech"]
["bevestigingsmaterialen","rijg-drukzadel  12…20 mm",{"v":10030176,"d":"10,030,176"},0.44,{"v":0,"d":"0.000"},{"v":0.35,"d":"35%"},null,"Install-Tech"]
["bevestigingsmaterialen","rijg-drukzadel  16… 34 mm",{"v":10030179,"d":"10,030,179"},0.57,{"v":0,"d":"0.000"},{"v":0.35,"d":"35%"},null,"Install-Tech"]
["bevestigingsmaterialen","spaanplaatschroef  3,5 x 13 mm, bolkop",{"v":10030182,"d":"10,030,182"},0.01,{"v":0,"d":"0.000"},{"v":0.35,"d":"35%"},null,"Install-Tech"]
["bevestigingsmaterialen","spaanplaatschroef  3,5 x 20 mm, bolkop",{"v":10030185,"d":"10,030,185"},0.01,{"v":0,"d":"0.000"},{"v":0.35,"d":"35%"},null,"Install-Tech"]
["bevestigingsmaterialen","spaanplaatschroef  3,5 x 25 mm, bolkop",{"v":10030188,"d":"10,030,188"},0.01,{"v":0,"d":"0.000"},{"v":0.35,"d":"35%"},null,"Install-Tech"]
["bevestigingsmaterialen","spaanplaatschroef  4 x 30 mm, bolkop",{"v":10030191,"d":"10,030,191"},0.02,{"v":0,"d":"0.000"},{"v":0.35,"d":"35%"},null,"Install-Tech"]
["bevestigingsmaterialen","spaanplaatschroef  4 x 40 mm, bolkop",{"v":10030194,"d":"10,030,194"},0.02,{"v":0,"d":"0.000"},{"v":0.35,"d":"35%"},null,"Install-Tech"]
["bevestigingsmaterialen","spijkerclip 16…19 mm",{"v":10030197,"d":"10,030,197"},0.13,{"v":0,"d":"0.000"},{"v":0.35,"d":"35%"},null,"Install-Tech"]
["bevestigingsmaterialen","spijkerclip 19…22 mm",{"v":10030200,"d":"10,030,200"},0.18,{"v":0,"d":"0.000"},{"v":0.35,"d":"35%"},null,"Install-Tech"]
["CEE-materiaal","CEE-contactstop 1p + N + PE 230 V 16 A IP44",{"v":10040100,"d":"10,040,100"},{"v":3.6,"d":"3.60"},{"v":0.2,"d":"0.200"},{"v":0.35,"d":"35%"},null,"Install-Tech"]
["CEE-materiaal","CEE-contactstop 3p + N + PE 400 V 16 A IP44",{"$f":"C57+3","v":{"v":10040103,"d":"10,040,103"}},6.85,{"v":0.26,"d":"0.260"},{"v":0.35,"d":"35%"},null,"Install-Tech"]
["CEE-materiaal","CEE-contactstop 3p + PE 400 V 16 A IP44",{"v":10040106,"d":"10,040,106"},4.45,{"v":0.22,"d":"0.220"},{"v":0.35,"d":"35%"},null,"Install-Tech"]
["CEE-materiaal","CEE-inbouwcontactdoos  1p + N + PE 230 V 16 A IP44",{"v":10040109,"d":"10,040,109"},6.87,{"v":0.33,"d":"0.330"},{"v":0.35,"d":"35%"},null,"Install-Tech"]
["CEE-materiaal","CEE-inbouwcontactdoos  3p + N + PE 400 V 16 A IP44",{"v":10040112,"d":"10,040,112"},11.56,{"v":0.37,"d":"0.370"},{"v":0.35,"d":"35%"},null,"Install-Tech"]
["CEE-materiaal","CEE-inbouwcontactdoos  3p + PE 400 V 16 A IP44",{"v":10040115,"d":"10,040,115"},8.67,{"v":0.35,"d":"0.350"},{"v":0.35,"d":"35%"},null,"Install-Tech"]
["CEE-materiaal","CEE-toestelcontactdoos 1p + N + PE 230 V 16 A opbouw IP44",{"v":10040118,"d":"10,040,118"},{"v":8.8,"d":"8.80"},{"v":0.33,"d":"0.330"},{"v":0.35,"d":"35%"},null,"Install-Tech"]
["CEE-materiaal","CEE-toestelcontactdoos 3p + N + PE 400 V 16 A opbouw IP44",{"v":10040121,"d":"10,040,121"},{"v":13.6,"d":"13.60"},{"v":0.37,"d":"0.370"},{"v":0.35,"d":"35%"},null,"Install-Tech"]
["CEE-materiaal","CEE-toestelcontactdoos 3p + PE 400 V 16 A opbouw IP44",{"v":10040124,"d":"10,040,124"},11.25,{"v":0.35,"d":"0.350"},{"v":0.35,"d":"35%"},null,"Install-Tech"]
["CEE-materiaal","CEE-wandcontactdoos 1p + N + PE 230 V 16 A opbouw IP44",{"v":10040127,"d":"10,040,127"},10.56,{"v":0.2,"d":"0.200"},{"v":0.35,"d":"35%"},null,"Install-Tech"]
["CEE-materiaal","CEE-wandcontactdoos 3p + N + PE 400 V 16 A opbouw IP44",{"v":10040130,"d":"10,040,130"},15.51,{"v":0.22,"d":"0.220"},{"v":0.35,"d":"35%"},null,"Install-Tech"]
["CEE-materiaal","CEE-wandcontactdoos 3p + PE 400 V 16 A opbouw IP44",{"v":10040133,"d":"10,040,133"},12.72,{"v":0.22,"d":"0.220"},{"v":0.35,"d":"35%"},null,"Install-Tech"]
["diversen","adereindhuls 0,5 mm²",{"v":10050100,"d":"10,050,100"},0.02,0.005,{"v":0.35,"d":"35%"},null,"Install-Tech"]
["diversen","adereindhuls 0,75 mm²",{"$f":"C69+3","v":{"v":10050103,"d":"10,050,103"}},0.02,0.005,{"v":0.35,"d":"35%"},null,"Install-Tech"]
["diversen","adereindhuls 1 mm²",{"$f":"C70+3","v":{"v":10050106,"d":"10,050,106"}},0.02,0.005,{"v":0.35,"d":"35%"},null,"Install-Tech"]
["diversen","adereindhuls 1,5 mm²",{"$f":"C71+3","v":{"v":10050109,"d":"10,050,109"}},0.02,0.005,{"v":0.35,"d":"35%"},null,"Install-Tech"]
["diversen","adereindhuls 2,5 mm²",{"$f":"C72+3","v":{"v":10050112,"d":"10,050,112"}},0.02,0.005,{"v":0.35,"d":"35%"},null,"Install-Tech"]
["diversen","adereindhuls 4 mm²",{"$f":"C73+3","v":{"v":10050115,"d":"10,050,115"}},0.03,0.005,{"v":0.35,"d":"35%"},null,"Install-Tech"]
["diversen","adereindhulzen (set)",{"$f":"C74+1","v":{"v":10050116,"d":"10,050,116"}},3.26,{"v":0,"d":"0.000"},{"v":0.35,"d":"35%"},null,"Install-Tech"]
["diversen","draailasdop, goliath, tot 24 mm²",{"$f":"C75+3","v":{"v":10050119,"d":"10,050,119"}},0.47,{"v":0.1,"d":"0.100"},{"v":0.35,"d":"35%"},null,"Install-Tech"]
["diversen","draailasdop, universeel, tot 12,5 mm²",{"$f":"C76+3","v":{"v":10050122,"d":"10,050,122"}},0.21,{"v":0.06,"d":"0.060"},{"v":0.35,"d":"35%"},null,"Install-Tech"]
["diversen","draailasdoppen, universeel (set)",{"$f":"C77+3","v":{"v":10050125,"d":"10,050,125"}},4.46,{"v":0,"d":"0.000"},{"v":0.35,"d":"35%"},null,"Install-Tech"]
["diversen","insteeklasklem (2p)",{"$f":"C77+3","v":{"v":10050125,"d":"10,050,125"}},0.11,{"v":0.06,"d":"0.060"},{"v":0.35,"d":"35%"},null,"Install-Tech"]
["diversen","insteeklasklem (3p)",{"$f":"C79+3","v":{"v":10050128,"d":"10,050,128"}},0.12,{"v":0.06,"d":"0.060"},{"v":0.35,"d":"35%"},null,"Install-Tech"]
{"$rows_left_out":374}