{"text_format":"3","workbook":"xlsx","n_sheets":10,"sheets":["Systeem","SjabloonVoorblad","SjabloonWerkproces","KerntakenEnWerkprocessen","Beheersingsniveaus","Voorblad","B1-K1-W1","B1-K1-W2","B1-K1-W3","B1-K1-W4"],"not_rendered":{"macros":1,"defined_names":19,"comments":6},"read":"whole","date_system":"1900"}

{"sheet":"Systeem","index":0,"n_rows":21,"n_cols":3,"rows_kept":21,"hidden":true}
[]
[null,"Ja/Nee"]
[null,"Ja"]
[null,"Nee"]
[]
[null,"Debug modus"]
[null,0,"Normale bedrijfsstand =  0"]
[]
[null,"Teksten"]
[null,"Werkproces motivatie:","Doe dit volgens richtlijnen van de school. Het is raadzaam om in elk geval een onvoldoende te motiveren.\nBij de motivering kan gebruikgemaakt worden van de beschrijvingen in de beoordelingstabel."]
[]
[null,"Fout markeer opmaak:"]
[]
[]
[null,"\"Grey-out\" opmaak:","greyed out"]
[]
[null,"Copyright tekst:","© Stichting Praktijkleren"]
[]
[null,"Regel afbreken werkprocesnaam:",45]
[]
{"$rows_left_out":2}
{"sheet":"SjabloonVoorblad","index":1,"n_rows":14,"n_cols":3,"rows_kept":14,"hidden":true,"merged":[[0,0,0,2],[2,0,2,2],[5,1,5,2],[6,1,6,2],[7,1,7,2],[8,1,8,2],[9,1,9,2],[11,1,11,2],[13,1,13,2]]}
["Beoordelingsformulier praktijkexamen"]
[]
["Algemene informatie"]
[]
["Code beoordelingsformulier en vaststellingsdatum",{"$f":"KerntakenEnWerkprocessen!B4","v":"BF_OMSS-BACS-LIHSS-MCS_BS22_B1-K1_1"},{"$f":"KerntakenEnWerkprocessen!B3","v":"[00-00-00]"}]
["Examenvorm",{"$f":"KerntakenEnWerkprocessen!C6","v":"Praktijkexamen - examen in een gesimuleerde omgeving of in de beroepspraktijk"}]
["Examennaam",{"$f":"KerntakenEnWerkprocessen!B7","v":0}]
["Examencode",{"$f":"KerntakenEnWerkprocessen!C7","v":"OMSS-BACS-LIHSS-MCS _BS22_B1-K1_1"}]
["Profiel",{"$f":"KerntakenEnWerkprocessen!B9","v":"P3: Office & Management Support Specialist, niveau 4\nP4: Business Administration & Control Specialist, niveau 4\nP5: Legal, Insurance & HR Services Specialist, niveau 4\nP6: Marketing & Communication Specialist, niveau 4"}]
["Kwalificatiedossier",{"$f":"KerntakenEnWerkprocessen!B8","v":"Business Services"}]
["Cohort en crebocode",{"$f":"KerntakenEnWerkprocessen!C8","v":"2022 en verder"},{"$f":"KerntakenEnWerkprocessen!C9","v":"25728/25725/25726/25727"}]
["Kerntaak",{"$f":"KerntakenEnWerkprocessen!C5","v":"Voert taken uit binnen de zakelijke dienstverlening"}]
[]
["Werkprocessen",{"$f":"KerntakenEnWerkprocessen!F2","v":"B1-K1-W1 Treedt op als aanspreekpunt voor klanten\nB1-K1-W2 Verzorgt zakelijke communicatie\nB1-K1-W3 Verwerkt gegevens\nB1-K1-W4 Werkt aan producten/opdrachten binnen geld-, goederen- en informatiebeweging\n \n \n \n \n \n \n \n \n \n \n \n"}]

{"sheet":"SjabloonWerkproces","index":2,"n_rows":19,"n_cols":4,"rows_kept":19,"hidden":true,"merged":[[9,1,9,6],[10,1,10,6],[12,1,12,6]]}
["Werkproces:",null,{"$f":"VLOOKUP(B1,werkprocessen,2,FALSE)","v":{"$error":"#N/A"}}]
["Eerste opdracht:",{"$f":"VLOOKUP(B1,KerntakenEnWerkprocessen!B13:E27,3,FALSE)","v":{"$error":"#N/A"}}]
["Laatste opdracht:",{"$f":"VLOOKUP(B1,KerntakenEnWerkprocessen!B13:E27,4,FALSE)","v":{"$error":"#N/A"}}]
["PuntentotaalMax",{"$f":"SUM(N:N)","v":0},"Invullen gestart:",{"$f":"IF(SUM(O:O)>0,TRUE,FALSE)","v":false}]
["PuntentotaalBehaald",{"$f":"SUM(M:M)","v":0}]
["#Ant. Mog. <=1",{"$f":"COUNTIF(N:N,1)","v":0}]
["#Ant. Mog. 2-3",{"$f":"COUNTIF(N:N,2)+COUNTIF(N:N,3)","v":0}]
["Cesuur",{"$f":"0.5*B4","v":0}]
[]
[null,{"$f":"CONCATENATE(kerntaakCode,\": \",kerntaakNaam)","v":"B1-K1: Voert taken uit binnen de zakelijke dienstverlening"}]
[null,{"$f":"CONCATENATE(VLOOKUP(B1,werkprocessen,1,FALSE),\": \",C1)","v":{"$error":"#N/A"}}]
[]
[null,"Persoonsinformatie"]
[null,"Datum"]
[null,"Kandidaat"]
[null,"Studentnummer"]
[null,"Klas"]
[null,"Beoordelaar 1"]
[null,"Beoordelaar 2"]

{"sheet":"KerntakenEnWerkprocessen","index":3,"n_rows":29,"n_cols":6,"rows_kept":29,"hidden":true,"merged":[[3,1,3,2]]}
["Kerntaken en werkprocessen"]
[{"$nulls":5},{"$f":"F27","v":"B1-K1-W1 Treedt op als aanspreekpunt voor klanten\nB1-K1-W2 Verzorgt zakelijke communicatie\nB1-K1-W3 Verwerkt gegevens\nB1-K1-W4 Werkt aan producten/opdrachten binnen geld-, goederen- en informatiebeweging\n \n \n \n \n \n \n \n \n \n \n \n"}]
["Vaststellingsdatum","[00-00-00]"]
["Code beoordelingsformulier","BF_OMSS-BACS-LIHSS-MCS_BS22_B1-K1_1"]
["Kerntaak","B1-K1","Voert taken uit binnen de zakelijke dienstverlening"]
["Examenvorm",null,"Praktijkexamen - examen in een gesimuleerde omgeving of in de beroepspraktijk"]
["Examennaam en Examencode",null,"OMSS-BACS-LIHSS-MCS _BS22_B1-K1_1"]
["Kwalificatiedossier en Cohort","Business Services","2022 en verder"]
["Profiel en crebocode","P3: Office & Management Support Specialist, niveau 4\nP4: Business Administration & Control Specialist, niveau 4\nP5: Legal, Insurance & HR Services Specialist, niveau 4\nP6: Marketing & Communication Specialist, niveau 4","25728/25725/25726/25727"]
[]
[]
["Werkprocessen","Code","Naam","EersteOpdracht","LaatsteOpdracht","TekstSamengevoegd"]
[null,"B1-K1-W1","Treedt op als aanspreekpunt voor klanten",{"$f":"MIN(IF(Beheersingsniveaus!$A$4:$A$151=KerntakenEnWerkprocessen!$B13,Beheersingsniveaus!$B$4:$B$151))","v":1},{"$f":"MAX(IF(Beheersingsniveaus!$A$4:$A$151=KerntakenEnWerkprocessen!$B13,Beheersingsniveaus!$B$4:$B$151))","v":1},{"$f":"B13&\" \"&C13&CHAR(10)","v":"B1-K1-W1 Treedt op als aanspreekpunt voor klanten\n"}]
[null,"B1-K1-W2","Verzorgt zakelijke communicatie",{"$f":"MIN(IF(Beheersingsniveaus!$A$4:$A$151=KerntakenEnWerkprocessen!$B14,Beheersingsniveaus!$B$4:$B$151))","v":2},{"$f":"MAX(IF(Beheersingsniveaus!$A$4:$A$151=KerntakenEnWerkprocessen!$B14,Beheersingsniveaus!$B$4:$B$151))","v":2},{"$f":"F13&B14&\" \"&C14&CHAR(10)","v":"B1-K1-W1 Treedt op als aanspreekpunt voor klanten\nB1-K1-W2 Verzorgt zakelijke communicatie\n"}]
[null,"B1-K1-W3","Verwerkt gegevens",{"$f":"MIN(IF(Beheersingsniveaus!$A$4:$A$151=KerntakenEnWerkprocessen!$B15,Beheersingsniveaus!$B$4:$B$151))","v":3},{"$f":"MAX(IF(Beheersingsniveaus!$A$4:$A$151=KerntakenEnWerkprocessen!$B15,Beheersingsniveaus!$B$4:$B$151))","v":3},{"$f":"F14&B15&\" \"&C15&CHAR(10)","v":"B1-K1-W1 Treedt op als aanspreekpunt voor klanten\nB1-K1-W2 Verzorgt zakelijke communicatie\nB1-K1-W3 Verwerkt gegevens\n"}]
[null,"B1-K1-W4","Werkt aan producten/opdrachten binnen geld-, goederen- en informatiebeweging",{"$f":"MIN(IF(Beheersingsniveaus!$A$4:$A$151=KerntakenEnWerkprocessen!$B16,Beheersingsniveaus!$B$4:$B$151))","v":4},{"$f":"MAX(IF(Beheersingsniveaus!$A$4:$A$151=KerntakenEnWerkprocessen!$B16,Beheersingsniveaus!$B$4:$B$151))","v":4},"B1-K1-W1 Treedt op als aanspreekpunt voor klanten\nB1-K1-W2 Verzorgt zakelijke communicatie\nB1-K1-W3 Verwerkt gegevens\nB1-K1-W4 Werkt aan producten/opdrachten binnen geld-, goederen- en informatiebeweging\n"]
[{"$nulls":3},{"$f":"MIN(IF(Beheersingsniveaus!$A$4:$A$151=KerntakenEnWerkprocessen!$B17,Beheersingsniveaus!$B$4:$B$151))","v":0},{"$f":"MAX(IF(Beheersingsniveaus!$A$4:$A$151=KerntakenEnWerkprocessen!$B17,Beheersingsniveaus!$B$4:$B$151))","v":0},"B1-K1-W1 Treedt op als aanspreekpunt voor klanten\nB1-K1-W2 Verzorgt zakelijke communicatie\nB1-K1-W3 Verwerkt gegevens\nB1-K1-W4 Werkt aan producten/opdrachten binnen geld-, goederen- en informatiebeweging\n \n"]
[{"$nulls":3},{"$f":"MIN(IF(Beheersingsniveaus!$A$4:$A$151=KerntakenEnWerkprocessen!$B18,Beheersingsniveaus!$B$4:$B$151))","v":0},{"$f":"MAX(IF(Beheersingsniveaus!$A$4:$A$151=KerntakenEnWerkprocessen!$B18,Beheersingsniveaus!$B$4:$B$151))","v":0},"B1-K1-W1 Treedt op als aanspreekpunt voor klanten\nB1-K1-W2 Verzorgt zakelijke communicatie\nB1-K1-W3 Verwerkt gegevens\nB1-K1-W4 Werkt aan producten/opdrachten binnen geld-, goederen- en informatiebeweging\n \n \n"]
[{"$nulls":3},{"$f":"MIN(IF(Beheersingsniveaus!$A$4:$A$151=KerntakenEnWerkprocessen!$B19,Beheersingsniveaus!$B$4:$B$151))","v":0},{"$f":"MAX(IF(Beheersingsniveaus!$A$4:$A$151=KerntakenEnWerkprocessen!$B19,Beheersingsniveaus!$B$4:$B$151))","v":0},"B1-K1-W1 Treedt op als aanspreekpunt voor klanten\nB1-K1-W2 Verzorgt zakelijke communicatie\nB1-K1-W3 Verwerkt gegevens\nB1-K1-W4 Werkt aan producten/opdrachten binnen geld-, goederen- en informatiebeweging\n \n \n \n"]
[{"$nulls":3},{"$f":"MIN(IF(Beheersingsniveaus!$A$4:$A$151=KerntakenEnWerkprocessen!$B20,Beheersingsniveaus!$B$4:$B$151))","v":0},{"$f":"MAX(IF(Beheersingsniveaus!$A$4:$A$151=KerntakenEnWerkprocessen!$B20,Beheersingsniveaus!$B$4:$B$151))","v":0},"B1-K1-W1 Treedt op als aanspreekpunt voor klanten\nB1-K1-W2 Verzorgt zakelijke communicatie\nB1-K1-W3 Verwerkt gegevens\nB1-K1-W4 Werkt aan producten/opdrachten binnen geld-, goederen- en informatiebeweging\n \n \n \n \n"]
{"$rows_left_out":10}
{"sheet":"Beheersingsniveaus","index":4,"n_rows":151,"n_cols":11,"rows_kept":151,"hidden":true}
["Beschrijvingen beheersingsniveaus"]
[]
["Werkproces","Opdracht","OpdrachtId","CriteriumId","Taken","Criterium","Beheersingsniveau 0","Beheersingsniveau 1","Beheersingsniveau 2","Beheersingsniveau 3","Cruciaal"]
["B1-K1-W1",1,{"$f":"IF(A4<>\"\",CONCATENATE(A4,\"-\",B4),\"\")","v":"B1-K1-W1-1"},{"$f":"IF(C4<>\"\",CONCATENATE(C4,\"-\",\"1\"),\"\")","v":"B1-K1-W1-1-1"},"T1, T2, T4, T5","Klantvriendelijk-heid","De kandidaat heeft de klant/bezoeker niet vriendelijk en correct te woord gestaan.","De kandidaat heeft de klant/bezoeker enigszins vriendelijk en correct te woord gestaan.","De kandidaat heeft de klant/bezoeker grotendeels vriendelijk en correct te woord gestaan.","De kandidaat heeft de klant/bezoeker volledig vriendelijk en correct te woord gestaan."]
["B1-K1-W1",1,{"$f":"IF(A5<>\"\",CONCATENATE(A5,\"-\",B5),\"\")","v":"B1-K1-W1-1"},{"$f":"IF(C5<>\"\",CONCATENATE(C5,\"-\",COUNTIF($C$4:C5,C5),\"\"),\"\")","v":"B1-K1-W1-1-2"},"T2","Klantvraag of klacht achterhalen","De klantgegevens en klantvraag of klacht zijn niet in kaart gebracht.","De klantgegevens en klantvraag of klacht zijn enigszins in kaart gebracht.","De klantgegevens en klantvraag of klacht zijn grotendeels in kaart gebracht.","De klantgegevens en klantvraag of klacht zijn volledig in kaart gebracht."]
["B1-K1-W1",1,"B1-K1-W1-1",{"$f":"IF(C6<>\"\",CONCATENATE(C6,\"-\",COUNTIF($C$4:C6,C6),\"\"),\"\")","v":"B1-K1-W1-1-3"},"T3, T4","Bevoegdheden en procedure","De kandidaat heeft niet overeenkomstig zijn bevoegdheden of de procedure gehandeld.","De kandidaat heeft enigszins overeenkomstig zijn bevoegdheden en de procedure gehandeld.","De kandidaat heeft grotendeels overeenkomstig zijn bevoegdheden en de procedure gehandeld.","De kandidaat heeft volledig overeenkomstig zijn bevoegdheden en de procedure gehandeld."]
["B1-K1-W1",1,"B1-K1-W1-1",{"$f":"IF(C7<>\"\",CONCATENATE(C7,\"-\",COUNTIF($C$4:C7,C7),\"\"),\"\")","v":"B1-K1-W1-1-4"},"T3, T4","Informeren en doorverwijzen","De bezoeker/klant is onjuist of op niet begrijpelijke wijze geïnformeerd, geadviseerd of doorverwezen. ","De bezoeker/klant is enigszins juist en op enigszins begrijpelijke wijze geïnformeerd, geadviseerd of doorverwezen.","De bezoeker/klant is grotendeels juist en op grotendeels begrijpelijke wijze geïnformeerd, geadviseerd of doorverwezen.","De bezoeker/klant is volledig juist en op volledig begrijpelijke wijze geïnformeerd, geadviseerd of doorverwezen."]
["B1-K1-W1",1,"B1-K1-W1-1",{"$f":"IF(C8<>\"\",CONCATENATE(C8,\"-\",COUNTIF($C$4:C8,C8),\"\"),\"\")","v":"B1-K1-W1-1-5"},"T5","Vastleggen","Het klantcontact is onjuist vastgelegd.","Het klantcontact is enigszins juist vastgelegd.","Het klantcontact is grotendeels juist vastgelegd.","Het klantcontact is volledig juist vastgelegd."]
["B1-K1-W1",1,"B1-K1-W1-1",{"$f":"IF(C9<>\"\",CONCATENATE(C9,\"-\",COUNTIF($C$4:C9,C9),\"\"),\"\")","v":"B1-K1-W1-1-6"},"T5","Klantrelatie","De klantrelatie is niet opgebouwd of onderhouden.","De klantrelatie is enigszins opgebouwd of onderhouden.","De klantrelatie is grotendeels opgebouwd of onderhouden.","De klantrelatie is volledig opgebouwd of onderhouden."]
["B1-K1-W2",2,"B1-K1-W2-2",{"$f":"IF(C10<>\"\",CONCATENATE(C10,\"-\",COUNTIF($C$4:C10,C10),\"\"),\"\")","v":"B1-K1-W2-2-1"},"T1, T2","Gegevens verzamelen en controleren ","De benodigde gegevens zijn onjuist of niet volledig verzameld of niet gecontroleerd.","De benodigde gegevens zijn enigszins juist en enigszins volledig verzameld en gecontroleerd. ","De benodigde gegevens zijn grotendeels juist en grotendeels volledig verzameld en gecontroleerd.","De benodigde gegevens zijn volledig juist en volledig verzameld en gecontroleerd."]
["B1-K1-W2",2,"B1-K1-W2-2",{"$f":"IF(C11<>\"\",CONCATENATE(C11,\"-\",COUNTIF($C$4:C11,C11),\"\"),\"\")","v":"B1-K1-W2-2-2"},"T3","Inhoud","De inhoud van het bericht is onjuist overgebracht.","De inhoud van het bericht is enigszins juist overgebracht.","De inhoud van het bericht is grotendeels juist overgebracht.","De inhoud van het bericht is volledig juist overgebracht."]
["B1-K1-W2",2,"B1-K1-W2-2",{"$f":"IF(C12<>\"\",CONCATENATE(C12,\"-\",COUNTIF($C$4:C12,C12),\"\"),\"\")","v":"B1-K1-W2-2-3"},"T3","Communicatie","De communicatie is niet afgestemd op de ontvanger(s).","De communicatie is enigszins afgestemd op de ontvanger(s). ","De communicatie is grotendeels afgestemd op de ontvanger(s).","De communicatie is volledig afgestemd op de ontvanger(s)."]
["B1-K1-W2",2,"B1-K1-W2-2",{"$f":"IF(C13<>\"\",CONCATENATE(C13,\"-\",COUNTIF($C$4:C13,C13),\"\"),\"\")","v":"B1-K1-W2-2-4"},"T3","Taalgebruik ","Het taalgebruik is niet correct.","Het taalgebruik is enigszins correct.","Het taalgebruik is grotendeels correct.","Het taalgebruik is volledig correct."]
["B1-K1-W2",2,"B1-K1-W2-2",{"$f":"IF(C14<>\"\",CONCATENATE(C14,\"-\",COUNTIF($C$4:C14,C14),\"\"),\"\")","v":"B1-K1-W2-2-5"},"T4","Voortgang en afhandeling","De voortgang en afhandeling van de correspondentie is niet of niet juist bewaakt.","De voortgang en afhandeling van de correspondentie is juist bewaakt."]
["B1-K1-W3",3,"B1-K1-W3-3",{"$f":"IF(C15<>\"\",CONCATENATE(C15,\"-\",COUNTIF($C$4:C15,C15),\"\"),\"\")","v":"B1-K1-W3-3-1"},"T1","Gegevens invoeren en/of wijzigen","De gegevens zijn onjuist ingevoerd en/of gewijzigd.","De gegevens zijn volledig juist ingevoerd en/of gewijzigd."]
["B1-K1-W3",3,"B1-K1-W3-3",{"$f":"IF(C16<>\"\",CONCATENATE(C16,\"-\",COUNTIF($C$4:C16,C16),\"\"),\"\")","v":"B1-K1-W3-3-2"},"T2","Controle en rapportage","Controle en rapportage zijn niet juist.","Controle en rapportage zijn enigszins juist.","Controle en rapportage zijn grotendeels juist.","Controle en rapportage zijn volledig juist."]
["B1-K1-W3",3,"B1-K1-W3-3",{"$f":"IF(C17<>\"\",CONCATENATE(C17,\"-\",COUNTIF($C$4:C17,C17),\"\"),\"\")","v":"B1-K1-W3-3-3"},"T3","Invullen","De (standaard) documenten zijn niet juist ingevuld.","De (standaard) documenten zijn juist ingevuld."]
["B1-K1-W3",3,"B1-K1-W3-3",{"$f":"IF(C18<>\"\",CONCATENATE(C18,\"-\",COUNTIF($C$4:C18,C18),\"\"),\"\")","v":"B1-K1-W3-3-4"},"T3","Archiveren ","De gebruikte documenten zijn niet op de juiste wijze gearchiveerd.","De gebruikte documenten zijn op de juiste wijze gearchiveerd."]
["B1-K1-W3",3,"B1-K1-W3-3",{"$f":"IF(C19<>\"\",CONCATENATE(C19,\"-\",COUNTIF($C$4:C19,C19),\"\"),\"\")","v":"B1-K1-W3-3-5"},"T3","Richtlijnen veiligheid en communicatie","Er is niet in overeenstemming met richtlijnen en wetgeving gehandeld. ","Er is in overeenstemming met richtlijnen en wetgeving gehandeld."]
["B1-K1-W3",3,"B1-K1-W3-3",{"$f":"IF(C20<>\"\",CONCATENATE(C20,\"-\",COUNTIF($C$4:C20,C20),\"\"),\"\")","v":"B1-K1-W3-3-6"},"T4","Management-informatie leveren ","De rapportage voor het management bevat niet de gevraagde informatie.","De rapportage voor het management bevat enigszins de gevraagde informatie.","De rapportage voor het management bevat grotendeels de gevraagde informatie.","De rapportage voor het management bevat volledig de gevraagde informatie."]
{"$rows_left_out":132}
{"sheet":"Voorblad","index":5,"n_rows":14,"n_cols":3,"rows_kept":14,"merged":[[0,0,0,2],[2,0,2,2],[5,1,5,2],[6,1,6,2],[7,1,7,2],[8,1,8,2],[9,1,9,2],[11,1,11,2],[13,1,13,2]]}
["Beoordelingsformulier praktijkexamen"]
[]
["Algemene informatie"]
[]
["Code beoordelingsformulier en vaststellingsdatum",{"$f":"KerntakenEnWerkprocessen!B4","v":"BF_OMSS-BACS-LIHSS-MCS_BS22_B1-K1_1"},"2022-03-10"]
["Examenvorm",{"$f":"KerntakenEnWerkprocessen!C6","v":"Praktijkexamen - examen in een gesimuleerde omgeving of in de beroepspraktijk"}]
["Examennaam"]
["Examencode",{"$f":"KerntakenEnWerkprocessen!C7","v":"OMSS-BACS-LIHSS-MCS _BS22_B1-K1_1"}]
["Profiel",{"$f":"KerntakenEnWerkprocessen!B9","v":"P3: Office & Management Support Specialist, niveau 4\nP4: Business Administration & Control Specialist, niveau 4\nP5: Legal, Insurance & HR Services Specialist, niveau 4\nP6: Marketing & Communication Specialist, niveau 4"}]
["Kwalificatiedossier",{"$f":"KerntakenEnWerkprocessen!B8","v":"Business Services"}]
["Cohort en crebocode",{"$f":"KerntakenEnWerkprocessen!C8","v":"2022 en verder"},{"$f":"KerntakenEnWerkprocessen!C9","v":"25728/25725/25726/25727"}]
["Kerntaak",{"$f":"KerntakenEnWerkprocessen!C5","v":"Voert taken uit binnen de zakelijke dienstverlening"}]
[]
["Werkprocessen",{"$f":"KerntakenEnWerkprocessen!F2","v":"B1-K1-W1 Treedt op als aanspreekpunt voor klanten\nB1-K1-W2 Verzorgt zakelijke communicatie\nB1-K1-W3 Verwerkt gegevens\nB1-K1-W4 Werkt aan producten/opdrachten binnen geld-, goederen- en informatiebeweging\n \n \n \n \n \n \n \n \n \n \n \n"}]

{"sheet":"B1-K1-W1","index":6,"n_rows":70,"n_cols":15,"rows_kept":70,"merged":[[9,1,9,6],[10,1,10,6],[12,1,12,6],[20,1,20,6],[30,1,30,6],[55,1,55,6],[56,1,56,6],[64,1,64,6],[68,2,68,3],[69,2,69,3]]}
["Werkproces:","B1-K1-W1",{"$f":"VLOOKUP(B1,werkprocessen,2,FALSE)","v":"Treedt op als aanspreekpunt voor klanten"}]
["Eerste opdracht:",{"$f":"VLOOKUP(B1,KerntakenEnWerkprocessen!B13:E27,3,FALSE)","v":1}]
["Laatste opdracht:",{"$f":"VLOOKUP(B1,KerntakenEnWerkprocessen!B13:E27,4,FALSE)","v":1}]
["PuntentotaalMax",{"$f":"SUM(N:N)","v":18},"Invullen gestart:",{"$f":"IF(SUM(O:O)>0,TRUE,FALSE)","v":false}]
["PuntentotaalBehaald",{"$f":"SUM(M:M)","v":0}]
["#Ant. Mog. <=1",{"$f":"COUNTIF(N:N,1)","v":0}]
["#Ant. Mog. 2-3",{"$f":"COUNTIF(N:N,2)+COUNTIF(N:N,3)","v":6}]
["Cesuur",{"$f":"0.5*B4","v":9}]
[]
[null,{"$f":"CONCATENATE(kerntaakCode,\": \",kerntaakNaam)","v":"B1-K1: Voert taken uit binnen de zakelijke dienstverlening"}]
[null,{"$f":"CONCATENATE(VLOOKUP(B1,werkprocessen,1,FALSE),\": \",C1)","v":"B1-K1-W1: Treedt op als aanspreekpunt voor klanten"}]
[]
[null,"Persoonsinformatie"]
[null,"Datum"]
[null,"Kandidaat"]
[null,"Studentnummer"]
[null,"Klas"]
[null,"Beoordelaar 1"]
[null,"Beoordelaar 2"]
[]
{"$rows_left_out":51}
{"sheet":"B1-K1-W2","index":7,"n_rows":64,"n_cols":15,"rows_kept":64,"merged":[[9,1,9,6],[10,1,10,6],[12,1,12,6],[20,1,20,6],[29,1,29,6],[49,1,49,6],[50,1,50,6],[58,1,58,6],[62,2,62,3],[63,2,63,3]]}
["Werkproces:","B1-K1-W2",{"$f":"VLOOKUP(B1,werkprocessen,2,FALSE)","v":"Verzorgt zakelijke communicatie"}]
["Eerste opdracht:",{"$f":"VLOOKUP(B1,KerntakenEnWerkprocessen!B13:E27,3,FALSE)","v":2}]
["Laatste opdracht:",{"$f":"VLOOKUP(B1,KerntakenEnWerkprocessen!B13:E27,4,FALSE)","v":2}]
["PuntentotaalMax",{"$f":"SUM(N:N)","v":13},"Invullen gestart:",{"$f":"IF(SUM(O:O)>0,TRUE,FALSE)","v":false}]
["PuntentotaalBehaald",{"$f":"SUM(M:M)","v":0}]
["#Ant. Mog. <=1",{"$f":"COUNTIF(N:N,1)","v":1}]
["#Ant. Mog. 2-3",{"$f":"COUNTIF(N:N,2)+COUNTIF(N:N,3)","v":4}]
["Cesuur",{"$f":"0.5*B4","v":6.5}]
[]
[null,{"$f":"CONCATENATE(kerntaakCode,\": \",kerntaakNaam)","v":"B1-K1: Voert taken uit binnen de zakelijke dienstverlening"}]
[null,{"$f":"CONCATENATE(VLOOKUP(B1,werkprocessen,1,FALSE),\": \",C1)","v":"B1-K1-W2: Verzorgt zakelijke communicatie"}]
[]
[null,"Persoonsinformatie"]
[null,"Datum"]
[null,"Kandidaat"]
[null,"Studentnummer"]
[null,"Klas"]
[null,"Beoordelaar 1"]
[null,"Beoordelaar 2"]
[]
{"$rows_left_out":45}
{"sheet":"B1-K1-W3","index":8,"n_rows":70,"n_cols":15,"rows_kept":70,"merged":[[9,1,9,6],[10,1,10,6],[12,1,12,6],[20,1,20,6],[32,1,32,6],[55,1,55,6],[56,1,56,6],[64,1,64,6],[68,2,68,3],[69,2,69,3]]}
["Werkproces:","B1-K1-W3",{"$f":"VLOOKUP(B1,werkprocessen,2,FALSE)","v":"Verwerkt gegevens"}]
["Eerste opdracht:",{"$f":"VLOOKUP(B1,KerntakenEnWerkprocessen!B13:E27,3,FALSE)","v":3}]
["Laatste opdracht:",{"$f":"VLOOKUP(B1,KerntakenEnWerkprocessen!B13:E27,4,FALSE)","v":3}]
["PuntentotaalMax",{"$f":"SUM(N:N)","v":16},"Invullen gestart:",{"$f":"IF(SUM(O:O)>0,TRUE,FALSE)","v":false}]
["PuntentotaalBehaald",{"$f":"SUM(M:M)","v":0}]
["#Ant. Mog. <=1",{"$f":"COUNTIF(N:N,1)","v":4}]
["#Ant. Mog. 2-3",{"$f":"COUNTIF(N:N,2)+COUNTIF(N:N,3)","v":4}]
["Cesuur",{"$f":"0.5*B4","v":8}]
[]
[null,{"$f":"CONCATENATE(kerntaakCode,\": \",kerntaakNaam)","v":"B1-K1: Voert taken uit binnen de zakelijke dienstverlening"}]
[null,{"$f":"CONCATENATE(VLOOKUP(B1,werkprocessen,1,FALSE),\": \",C1)","v":"B1-K1-W3: Verwerkt gegevens"}]
[]
[null,"Persoonsinformatie"]
[null,"Datum"]
[null,"Kandidaat"]
[null,"Studentnummer"]
[null,"Klas"]
[null,"Beoordelaar 1"]
[null,"Beoordelaar 2"]
[]
{"$rows_left_out":51}
{"sheet":"B1-K1-W4","index":9,"n_rows":74,"n_cols":15,"rows_kept":74,"merged":[[9,1,9,6],[10,1,10,6],[12,1,12,6],[20,1,20,6],[31,1,31,6],[59,1,59,6],[60,1,60,6],[68,1,68,6],[72,2,72,3],[73,2,73,3]]}
["Werkproces:","B1-K1-W4",{"$f":"VLOOKUP(B1,werkprocessen,2,FALSE)","v":"Werkt aan producten/opdrachten binnen geld-, goederen- en informatiebeweging"}]
["Eerste opdracht:",{"$f":"VLOOKUP(B1,KerntakenEnWerkprocessen!B13:E27,3,FALSE)","v":4}]
["Laatste opdracht:",{"$f":"VLOOKUP(B1,KerntakenEnWerkprocessen!B13:E27,4,FALSE)","v":4}]
["PuntentotaalMax",{"$f":"SUM(N:N)","v":21},"Invullen gestart:",{"$f":"IF(SUM(O:O)>0,TRUE,FALSE)","v":false}]
["PuntentotaalBehaald",{"$f":"SUM(M:M)","v":0}]
["#Ant. Mog. <=1",{"$f":"COUNTIF(N:N,1)","v":0}]
["#Ant. Mog. 2-3",{"$f":"COUNTIF(N:N,2)+COUNTIF(N:N,3)","v":7}]
["Cesuur",{"$f":"0.5*B4","v":10.5}]
[]
[null,{"$f":"CONCATENATE(kerntaakCode,\": \",kerntaakNaam)","v":"B1-K1: Voert taken uit binnen de zakelijke dienstverlening"}]
[null,{"$f":"CONCATENATE(VLOOKUP(B1,werkprocessen,1,FALSE),\": \",C1)","v":"B1-K1-W4: Werkt aan producten/opdrachten binnen geld-, goederen- en informatiebeweging"}]
[]
[null,"Persoonsinformatie"]
[null,"Datum"]
[null,"Kandidaat"]
[null,"Studentnummer"]
[null,"Klas"]
[null,"Beoordelaar 1"]
[null,"Beoordelaar 2"]
[]
{"$rows_left_out":54}