{"text_format":"3","workbook":"xlsx","n_sheets":15,"sheets":["home","navibloemen","naviplanten","navibloemisterijartikelen","bloemen","planten","bloemisterijartikelen","artbloemen","artplanten","artbloemisterijartikelen","winkelwagen","data","databloemen","dataplanten","databloemisterijartikelen"],"not_rendered":{"images":71,"macros":1,"defined_names":24},"read":"whole","date_system":"1900"}

{"sheet":"home","index":0,"n_rows":23,"n_cols":10,"rows_kept":23,"merged":[[1,4,1,10],[3,5,7,9]]}
[]
[{"$nulls":4},{"$f":"naam & \" - \" & nummer","v":" - "}]
[null,"è",{"$f":"HYPERLINK(\"\",\"home\")","v":"home"}]
[null,null,{"$f":"HYPERLINK(\"\",\"bloemen, snijgroen en overig\")","v":"bloemen, snijgroen en overig"},null,null,"Welkom op de site van Botanica, dé inkoopservice voor de bloemist. In onze webshop heeft u de beschikking over een groot assortiment snijbloemen, planten en bloemisterijartikelen."]
[null,null,{"$f":"HYPERLINK(\"\",\"planten\")","v":"planten"}]
[null,null,{"$f":"HYPERLINK(\"\",\"bloemisterijartikelen\")","v":"bloemisterijartikelen"}]
[]
[null,null,{"$f":"HYPERLINK(\"\",\"winkelwagen\")","v":"winkelwagen"}]
{"$rows_empty":14}
[{"$nulls":5},{"$f":"HYPERLINK(\"\",\"bloemen, snijgroen en overig\")","v":"bloemen, snijgroen en overig"},null,{"$f":"HYPERLINK(\"\",\"planten\")","v":"planten"},null,{"$f":"HYPERLINK(\"\",\"bloemisterijartikelen\")","v":"bloemisterijartikelen"}]
{"$rows_left_out":1}
{"sheet":"navibloemen","index":1,"n_rows":23,"n_cols":8,"rows_kept":23,"merged":[[1,4,1,10],[3,5,7,9]]}
[]
[{"$nulls":4},{"$f":"naam & \" - \" & nummer","v":" - "}]
[null,null,{"$f":"HYPERLINK(\"\",\"home\")","v":"home"}]
[null,"è",{"$f":"HYPERLINK(\"\",\"bloemen, snijgroen en overig\")","v":"bloemen, snijgroen en overig"},null,null,"Bloemen, snijgroen en overig"]
[null,null,{"$f":"HYPERLINK(\"\",\"    bloemen\")","v":"    bloemen"}]
[null,null,{"$f":"HYPERLINK(\"\",\"    snijgroen\")","v":"    snijgroen"}]
[null,null,{"$f":"HYPERLINK(\"\",\"planten\")","v":"planten"}]
[null,null,{"$f":"HYPERLINK(\"\",\"bloemisterijartikelen\")","v":"bloemisterijartikelen"}]
[]
[null,null,{"$f":"HYPERLINK(\"\",\"winkelwagen\")","v":"winkelwagen"}]
{"$rows_left_out":3}
{"sheet":"naviplanten","index":2,"n_rows":38,"n_cols":10,"rows_kept":38,"merged":[[1,4,1,10],[3,5,7,9]]}
[]
[{"$nulls":4},{"$f":"naam & \" - \" & nummer","v":" - "}]
[null,null,{"$f":"HYPERLINK(\"\",\"home\")","v":"home"}]
[null,null,{"$f":"HYPERLINK(\"\",\"bloemen, snijgroen en overig\")","v":"bloemen, snijgroen en overig"},null,null,"Planten"]
[null,"è",{"$f":"HYPERLINK(\"\",\"planten\")","v":"planten"}]
[null,null,{"$f":"HYPERLINK(\"\",\"    bladplanten\")","v":"    bladplanten"}]
[null,null,{"$f":"HYPERLINK(\"\",\"    bloeiende planten\")","v":"    bloeiende planten"}]
[null,null,{"$f":"HYPERLINK(\"\",\"    cactussen/succulenten\")","v":"    cactussen/succulenten"}]
[null,null,{"$f":"HYPERLINK(\"\",\"    perkplanten\")","v":"    perkplanten"}]
[null,null,{"$f":"HYPERLINK(\"\",\"bloemisterijartikelen\")","v":"bloemisterijartikelen"}]
{"$rows_left_out":7}
{"sheet":"navibloemisterijartikelen","index":3,"n_rows":38,"n_cols":10,"rows_kept":38,"merged":[[1,4,1,10],[3,5,7,9]]}
[]
[{"$nulls":4},{"$f":"naam & \" - \" & nummer","v":" - "}]
[null,null,{"$f":"HYPERLINK(\"\",\"home\")","v":"home"}]
[null,null,{"$f":"HYPERLINK(\"\",\"bloemen, snijgroen en overig\")","v":"bloemen, snijgroen en overig"},null,null,"Bloemisterijartikelen"]
[null,null,{"$f":"HYPERLINK(\"\",\"planten\")","v":"planten"}]
[null,"è",{"$f":"HYPERLINK(\"\",\"bloemisterijartikelen\")","v":"bloemisterijartikelen"}]
[null,null,{"$f":"HYPERLINK(\"\",\"    decoratie\")","v":"    decoratie"}]
[null,null,{"$f":"HYPERLINK(\"\",\"    hulpmiddelen\")","v":"    hulpmiddelen"}]
[null,null,{"$f":"HYPERLINK(\"\",\"    kransen\")","v":"    kransen"}]
[null,null,{"$f":"HYPERLINK(\"\",\"    pot, vaas, schaal\")","v":"    pot, vaas, schaal"}]
{"$rows_left_out":7}
{"sheet":"bloemen","index":4,"n_rows":35,"n_cols":10,"rows_kept":35,"merged":[[1,4,1,10],[2,4,5,10]]}
[]
[{"$nulls":4},{"$f":"naam & \" - \" & nummer","v":" - "}]
[null,null,{"$f":"HYPERLINK(\"\",\"home\")","v":"home"},null,"Bloemen"]
[null,null,{"$f":"HYPERLINK(\"\",\"bloemen, snijgroen en overig\")","v":"bloemen, snijgroen en overig"}]
[null,null,{"$f":"HYPERLINK(\"\",\"    bloemen\")","v":"    bloemen"}]
[null,"è",{"$f":"HYPERLINK(\"\",\"    snijgroen\")","v":"    snijgroen"}]
[null,null,{"$f":"HYPERLINK(\"\",\"planten\")","v":"planten"}]
[null,null,{"$f":"HYPERLINK(\"\",\"bloemisterijartikelen\")","v":"bloemisterijartikelen"}]
[]
[null,null,{"$f":"HYPERLINK(\"\",\"winkelwagen\")","v":"winkelwagen"}]
{"$rows_left_out":5}
{"sheet":"planten","index":5,"n_rows":35,"n_cols":10,"rows_kept":35,"merged":[[1,4,1,10],[2,4,5,10]]}
[]
[{"$nulls":4},{"$f":"naam & \" - \" & nummer","v":" - "}]
[null,null,{"$f":"HYPERLINK(\"\",\"home\")","v":"home"},null,"Planten"]
[null,null,{"$f":"HYPERLINK(\"\",\"bloemen, snijgroen en overig\")","v":"bloemen, snijgroen en overig"}]
[null,null,{"$f":"HYPERLINK(\"\",\"planten\")","v":"planten"}]
[null,null,{"$f":"HYPERLINK(\"\",\"    bladplanten\")","v":"    bladplanten"}]
[null,null,{"$f":"HYPERLINK(\"\",\"    bloeiende planten\")","v":"    bloeiende planten"}]
[null,null,{"$f":"HYPERLINK(\"\",\"    cactussen/succulenten\")","v":"    cactussen/succulenten"}]
[null,"è",{"$f":"HYPERLINK(\"\",\"    perkplanten\")","v":"    perkplanten"}]
[null,null,{"$f":"HYPERLINK(\"\",\"bloemisterijartikelen\")","v":"bloemisterijartikelen"}]
{"$rows_left_out":7}
{"sheet":"bloemisterijartikelen","index":6,"n_rows":35,"n_cols":10,"rows_kept":35,"merged":[[1,4,1,10],[2,4,5,10]]}
[]
[{"$nulls":4},{"$f":"naam & \" - \" & nummer","v":" - "}]
[null,null,{"$f":"HYPERLINK(\"\",\"home\")","v":"home"},null,"Bloemisterijartikelen"]
[null,null,{"$f":"HYPERLINK(\"\",\"bloemen, snijgroen en overig\")","v":"bloemen, snijgroen en overig"}]
[null,null,{"$f":"HYPERLINK(\"\",\"planten\")","v":"planten"}]
[null,null,{"$f":"HYPERLINK(\"\",\"bloemisterijartikelen\")","v":"bloemisterijartikelen"}]
[null,null,{"$f":"HYPERLINK(\"\",\"    decoratie\")","v":"    decoratie"}]
[null,"è",{"$f":"HYPERLINK(\"\",\"    hulpmiddelen\")","v":"    hulpmiddelen"}]
[null,null,{"$f":"HYPERLINK(\"\",\"    kransen\")","v":"    kransen"}]
[null,null,{"$f":"HYPERLINK(\"\",\"    pot, vaas, schaal\")","v":"    pot, vaas, schaal"}]
{"$rows_left_out":7}
{"sheet":"artbloemen","index":7,"n_rows":16,"n_cols":8,"rows_kept":16,"merged":[[1,4,1,8],[3,5,4,7],[5,5,18,5],[5,6,6,6],[5,7,6,7],[7,6,8,6],[7,7,8,7],[9,6,10,6],[9,7,10,7],[11,6,12,6],[11,7,12,7],[13,6,14,6],[13,7,14,7],[15,6,16,6],[15,7,16,7]]}
[]
[{"$nulls":4},{"$f":"naam & \" - \" & nummer","v":" - "}]
[null,null,{"$f":"HYPERLINK(\"\",\"home\")","v":"home"}]
[null,null,{"$f":"HYPERLINK(\"\",\"bloemen, snijgroen en overig\")","v":"bloemen, snijgroen en overig"},null,null,{"$f":"geselecteerd","v":"bindtouw klos"}]
[null,null,{"$f":"HYPERLINK(\"\",\"    bloemen\")","v":"    bloemen"}]
[null,null,{"$f":"HYPERLINK(\"\",\"    snijgroen\")","v":"    snijgroen"},{"$nulls":3},"aantal per bos:",{"$f":"inhoudvisueel","v":"500 gr"}]
[null,"è","        Salal"]
[null,null,{"$f":"HYPERLINK(\"\",\"planten\")","v":"planten"},{"$nulls":3},"kleur:",{"$f":"INDEX(OFFSET(databloemen!C:C,0,4),rij)","v":"groen"}]
[null,null,{"$f":"HYPERLINK(\"\",\"bloemisterijartikelen\")","v":"bloemisterijartikelen"}]
[{"$nulls":6},"steellengte:",{"$f":"INDEX(OFFSET(databloemen!C:C,0,5),rij)","v":"n.v.t."}]
{"$rows_left_out":7}
{"sheet":"artplanten","index":8,"n_rows":16,"n_cols":8,"rows_kept":16,"merged":[[1,4,1,8],[3,5,4,7],[5,5,17,5],[5,6,6,6],[5,7,6,7],[7,6,8,6],[7,7,8,7],[9,6,10,6],[9,7,10,7],[11,6,12,6],[11,7,12,7],[13,6,14,6],[13,7,14,7],[15,6,16,6],[15,7,16,7]]}
[]
[{"$nulls":4},{"$f":"naam & \" - \" & nummer","v":" - "}]
[null,null,{"$f":"HYPERLINK(\"\",\"home\")","v":"home"}]
[null,null,{"$f":"HYPERLINK(\"\",\"bloemen, snijgroen en overig\")","v":"bloemen, snijgroen en overig"},null,null,{"$f":"geselecteerd","v":"bindtouw klos"}]
[null,null,{"$f":"HYPERLINK(\"\",\"planten\")","v":"planten"}]
[null,null,{"$f":"HYPERLINK(\"\",\"    bladplanten\")","v":"    bladplanten"},{"$nulls":3},"inhoud fust:",{"$f":"inhoudvisueel","v":"500 gr"}]
[null,null,{"$f":"HYPERLINK(\"\",\"    bloeiende planten\")","v":"    bloeiende planten"}]
[null,null,{"$f":"HYPERLINK(\"\",\"    cactussen/succulenten\")","v":"    cactussen/succulenten"},{"$nulls":3},"potmaat:",{"$f":"INDEX(OFFSET(dataplanten!C:C,0,5),rij)","v":15}]
[null,null,{"$f":"HYPERLINK(\"\",\"    perkplanten\")","v":"    perkplanten"}]
[null,"è","        Tagetes",{"$nulls":3},"kleur:",{"$f":"INDEX(OFFSET(dataplanten!C:C,0,4),rij)","v":"groen"}]
{"$rows_left_out":7}
{"sheet":"artbloemisterijartikelen","index":9,"n_rows":14,"n_cols":8,"rows_kept":14,"merged":[[1,4,1,8],[3,5,4,7],[5,5,18,5],[5,6,7,6],[5,7,7,7],[8,6,10,6],[8,7,10,7],[11,6,12,6],[11,7,12,7],[13,6,15,6],[13,7,15,7]]}
[]
[{"$nulls":4},{"$f":"naam & \" - \" & nummer","v":" - "}]
[null,null,{"$f":"HYPERLINK(\"\",\"home\")","v":"home"}]
[null,null,{"$f":"HYPERLINK(\"\",\"bloemen, snijgroen en overig\")","v":"bloemen, snijgroen en overig"},null,null,{"$f":"geselecteerd","v":"bindtouw klos"}]
[null,null,{"$f":"HYPERLINK(\"\",\"planten\")","v":"planten"}]
[null,null,{"$f":"HYPERLINK(\"\",\"bloemisterijartikelen\")","v":"bloemisterijartikelen"},{"$nulls":3},"inhoud:",{"$f":"inhoudvisueel","v":"500 gr"}]
[null,null,{"$f":"HYPERLINK(\"\",\"    decoratie\")","v":"    decoratie"}]
[null,null,{"$f":"HYPERLINK(\"\",\"    hulpmiddelen\")","v":"    hulpmiddelen"}]
[null,"è","        bindtouw klos",{"$nulls":3},"besteleenheid:",{"$f":"besteleenheid &  \" stuks\"","v":"4 stuks"}]
[null,null,{"$f":"HYPERLINK(\"\",\"    kransen\")","v":"    kransen"}]
{"$rows_left_out":5}
{"sheet":"winkelwagen","index":10,"n_rows":23,"n_cols":11,"rows_kept":23,"merged":[[1,4,1,11],[2,4,4,11],[6,5,7,5],[6,6,7,6],[6,7,7,7],[6,8,7,8],[6,9,7,9],[6,10,7,10],[8,11,9,11],[9,9,10,9],[9,10,10,10],[10,11,11,11],[12,9,13,9],[12,10,13,10],[12,11,13,11],[14,9,15,9],[14,10,15,10],[14,11,15,11],[16,9,17,9],[16,10,17,10],[16,11,17,11],[19,9,20,9],[19,10,20,10]]}
[]
[{"$nulls":4},{"$f":"naam & \" - \" & nummer","v":" - "}]
[null,null,{"$f":"HYPERLINK(\"\",\"home\")","v":"home"},null,"Winkelwagen"]
[null,null,{"$f":"HYPERLINK(\"\",\"bloemen, snijgroen en overig\")","v":"bloemen, snijgroen en overig"}]
[null,null,{"$f":"HYPERLINK(\"\",\"planten\")","v":"planten"}]
[null,null,{"$f":"HYPERLINK(\"\",\"bloemisterijartikelen\")","v":"bloemisterijartikelen"}]
[{"$nulls":5},"artikel","inhoud","besteleenheid","aantal","prijs per stuk","totaal"]
[null,"è",{"$f":"HYPERLINK(\"\",\"winkelwagen\")","v":"winkelwagen"}]
[]
[{"$nulls":9},"totaal:",{"$f":"SUM(K7:K9)","v":0}]
{"$rows_left_out":14}
{"sheet":"data","index":11,"n_rows":18,"n_cols":22,"rows_kept":18,"hidden":true,"merged":[[0,15,1,15],[0,16,1,16],[0,17,1,17],[0,18,1,18],[0,19,1,19],[0,20,1,20],[0,21,1,21],[0,22,1,22]]}
["Geselecteerd:","bindtouw klos",{"$nulls":19},{"$f":"R1*IF(S1=\"\",1,S1)*T1*U1","v":0}]
["Categorie:","bloemisterijartikelen"]
["Subcategorie:",{"$f":"INDEX(INDIRECT(\"data\"&categorie&\"!C:C\"),rij)","v":"hulpmiddelen"}]
["Rij:",{"$f":"MATCH(geselecteerd,INDIRECT(\"data\"&categorie&\"!B:B\"),0)","v":3}]
["Winkelwagennaam:",{"$f":"geselecteerd & \" (\" & inhoudvisueel & \")\"","v":"bindtouw klos (500 gr)"}]
["Inhoud:",{"$f":"IF(INDEX(INDIRECT(\"data\"&categorie&\"!E:E\"),rij)<>\"stuks\",1,INDEX(INDIRECT(\"data\"&categorie&\"!D:D\"),rij))","v":1}]
["Inhoud visueel:",{"$f":"INDEX(INDIRECT(\"data\"&categorie&\"!D:D\"),rij) & \" \" & INDEX(INDIRECT(\"data\"&categorie&\"!E:E\"),rij)","v":"500 gr"}]
["Besteleenheid:",{"$f":"IF(categorie=\"bloemisterijartikelen\",INDEX(INDIRECT(\"data\"&categorie&\"!G:G\"),rij),\"\")","v":4}]
["Aantal:",{"$f":"INDIRECT(\"art\" & categorie & \"!aantal\")","v":0}]
["Prijs:",{"$f":"INDEX(INDIRECT(\"data\"&categorie&\"!K:K\"),rij)","v":2.25}]
{"$rows_left_out":9}
{"sheet":"databloemen","index":12,"n_rows":13,"n_cols":14,"rows_kept":13,"hidden":true}
["aantal","naam","categorie","inhoud ","inhoud eenheid","voorraad (niet meer gebruikt)","kleur","steellengte","fustcode","prijs fust","prijs","btw","plaatnaam","afbeelding"]
[{"$f":"IFERROR(INDEX(winkelwagen!I:I,MATCH(B2 & \" (\" & D2 & \" \" & E2 & \")\",winkelwagen!F:F,0)),\"\")","v":""},"Alstroemeria","bloemen",60,"stuks",null,"brons",80,577,{"v":4,"d":"€ 4.00"},{"v":0.36,"d":"€ 0.36"},0.06,"Alstroemeria","shutterstock_481455946"]
[{"$f":"IFERROR(INDEX(winkelwagen!I:I,MATCH(B3 & \" (\" & D3 & \" \" & E3 & \")\",winkelwagen!F:F,0)),\"\")","v":""},"Aspidstra","snijgroen",100,"stuks",null,"groen","n.v.t.",999,0,{"v":0.1,"d":"€ 0.10"},0.06,"Aspidstra","shutterstock_727908424"]
[{"$f":"IFERROR(INDEX(winkelwagen!I:I,MATCH(B4 & \" (\" & D4 & \" \" & E4 & \")\",winkelwagen!F:F,0)),\"\")","v":""},"Chysanthemum","bloemen",75,"stuks",null,"groen",55,544,{"v":4,"d":"€ 4.00"},{"v":0.24,"d":"€ 0.24"},0.06,"Chysanthemum","shutterstock_512972047"]
[{"$f":"IFERROR(INDEX(winkelwagen!I:I,MATCH(B5 & \" (\" & D5 & \" \" & E5 & \")\",winkelwagen!F:F,0)),\"\")","v":""},"Conifeer","snijgroen",5,"stuks",null,"groen",50,566,{"v":4,"d":"€ 4.00"},{"v":1.85,"d":"€ 1.85"},0.06,"Conifeer","shutterstock_736144063"]
[{"$f":"IFERROR(INDEX(winkelwagen!I:I,MATCH(B6 & \" (\" & D6 & \" \" & E6 & \")\",winkelwagen!F:F,0)),\"\")","v":""},"Eucalyptus","snijgroen",10,"stuks",null,"grijs",70,566,{"v":4,"d":"€ 4.00"},{"v":2.15,"d":"€ 2.15"},0.06,"Eucalyptus","shutterstock_166285226"]
[{"$f":"IFERROR(INDEX(winkelwagen!I:I,MATCH(B7 & \" (\" & D7 & \" \" & E7 & \")\",winkelwagen!F:F,0)),\"\")","v":""},"Fatsia","snijgroen",150,"stuks",null,"groen",40,999,0,{"v":0.15,"d":"€ 0.15"},0.06,"Fatsia","shutterstock_346807439"]
[{"$f":"IFERROR(INDEX(winkelwagen!I:I,MATCH(B8 & \" (\" & D8 & \" \" & E8 & \")\",winkelwagen!F:F,0)),\"\")","v":""},"Freesia","bloemen",100,"stuks",null,"wit",50,566,{"v":4,"d":"€ 4.00"},{"v":0.23,"d":"€ 0.23"},0.06,"Freesia","shutterstock_678982522"]
[{"$f":"IFERROR(INDEX(winkelwagen!I:I,MATCH(B9 & \" (\" & D9 & \" \" & E9 & \")\",winkelwagen!F:F,0)),\"\")","v":""},"Gerbera","bloemen",40,"stuks",null,"gemengd",45,996,{"v":7,"d":"€ 7.00"},{"v":0.33,"d":"€ 0.33"},0.06,"Gerbera","shutterstock_611964899"]
[{"$f":"IFERROR(INDEX(winkelwagen!I:I,MATCH(B10 & \" (\" & D10 & \" \" & E10 & \")\",winkelwagen!F:F,0)),\"\")","v":""},"Lilium","bloemen",50,"stuks",null,"wit",90,997,{"v":7,"d":"€ 7.00"},{"v":0.77,"d":"€ 0.77"},0.06,"Lilium","shutterstock_762403792"]
{"$rows_left_out":4}
{"sheet":"dataplanten","index":13,"n_rows":26,"n_cols":14,"rows_kept":26,"hidden":true}
["aantal","naam","categorie","inhoud ","inhoud eenheid","voorraad (niet meer gebruikt)","kleur","potmaat","fustcode","prijs fust","prijs","btw","plaatnaam","afbeelding"]
[{"$f":"IFERROR(INDEX(winkelwagen!I:I,MATCH(B2 & \" (\" & D2 & \" \" & E2 & \")\",winkelwagen!F:F,0)),\"\")","v":""},"Aglaonema","bladplanten",4,"stuks",null,"wit/groen",17,404,{"v":0.31,"d":"€ 0.31"},{"v":7.16,"d":"€ 7.16"},0.06,"Aglaonema","shutterstock_115667032"]
[{"$f":"IFERROR(INDEX(winkelwagen!I:I,MATCH(B3 & \" (\" & D3 & \" \" & E3 & \")\",winkelwagen!F:F,0)),\"\")","v":""},"Aloe","cactussen/succulenten",3,"stuks",null,"groen",15,403,{"v":0.31,"d":"€ 0.31"},{"v":4.92,"d":"€ 4.92"},0.06,"Aloe","shutterstock_321021023"]
[{"$f":"IFERROR(INDEX(winkelwagen!I:I,MATCH(B4 & \" (\" & D4 & \" \" & E4 & \")\",winkelwagen!F:F,0)),\"\")","v":""},"Anthurium","bloeiende planten",10,"stuks",null,"rood",12,495,{"v":0.35,"d":"€ 0.35"},{"v":3.3,"d":"€ 3.30"},0.06,"Anthurium","shutterstock_89440570"]
[{"$f":"IFERROR(INDEX(winkelwagen!I:I,MATCH(B5 & \" (\" & D5 & \" \" & E5 & \")\",winkelwagen!F:F,0)),\"\")","v":""},"Beaucarnea","bladplanten",3,"stuks",null,"groen",19,955,{"v":0.27,"d":"€ 0.27"},{"v":10.05,"d":"€ 10.05"},0.06,"Beaucarnea","shutterstock_319380593"]
[{"$f":"IFERROR(INDEX(winkelwagen!I:I,MATCH(B6 & \" (\" & D6 & \" \" & E6 & \")\",winkelwagen!F:F,0)),\"\")","v":""},"Begonia","bloeiende planten",8,"stuks",null,"rood",12,814,{"v":0.44,"d":"€ 0.44"},{"v":1.27,"d":"€ 1.27"},0.06,"Begonia","shutterstock_60670180"]
[{"$f":"IFERROR(INDEX(winkelwagen!I:I,MATCH(B7 & \" (\" & D7 & \" \" & E7 & \")\",winkelwagen!F:F,0)),\"\")","v":""},"Begonia ","perkplanten",12,"stuks",null,"rose",9,418,{"v":0.29,"d":"€ 0.29"},{"v":0.19,"d":"€ 0.19"},0.06,"Begonia2","shutterstock_636142310"]
[{"$f":"IFERROR(INDEX(winkelwagen!I:I,MATCH(B8 & \" (\" & D8 & \" \" & E8 & \")\",winkelwagen!F:F,0)),\"\")","v":""},"Cereus","cactussen/succulenten",6,"stuks",null,"groen",12,206,{"v":0.22,"d":"€ 0.22"},{"v":3.3,"d":"€ 3.30"},0.06,"Cereus","shutterstock_698924086"]
[{"$f":"IFERROR(INDEX(winkelwagen!I:I,MATCH(B9 & \" (\" & D9 & \" \" & E9 & \")\",winkelwagen!F:F,0)),\"\")","v":""},"Chamaedorea","bladplanten",6,"stuks",null,"groen",17,306,{"v":0.34,"d":"€ 0.34"},{"v":2.09,"d":"€ 2.09"},0.06,"Chamaedorea","shutterstock_56817667"]
[{"$f":"IFERROR(INDEX(winkelwagen!I:I,MATCH(B10 & \" (\" & D10 & \" \" & E10 & \")\",winkelwagen!F:F,0)),\"\")","v":""},"Crassula","cactussen/succulenten",4,"stuks",null,"groen",17,404,{"v":0.31,"d":"€ 0.31"},{"v":4.92,"d":"€ 4.92"},0.06,"Crassula","shutterstock_747178597"]
{"$rows_left_out":17}
{"sheet":"databloemisterijartikelen","index":14,"n_rows":30,"n_cols":14,"rows_kept":30,"hidden":true}
["aantal","naam","categorie","inhoud","inhoud eenheid","voorraad (niet meer gebruikt)","besteleenheid","niet in gebruik","niet in gebruik","niet in gebruik","prijs","btw","plaatnaam","afbeelding"]
[{"$f":"IFERROR(INDEX(winkelwagen!I:I,MATCH(B2 & \" (\" & D2 & \" \" & E2 & \")\",winkelwagen!F:F,0)),\"\")","v":""},"accubak ","pot, vaas, schaal",1,"stuks",null,6,{"$nulls":3},{"v":4.45,"d":"€ 4.45"},0.21,"accubak ","shutterstock_131318207"]
[{"$f":"IFERROR(INDEX(winkelwagen!I:I,MATCH(B3 & \" (\" & D3 & \" \" & E3 & \")\",winkelwagen!F:F,0)),\"\")","v":""},"bindtouw klos","hulpmiddelen",500,"gr",null,4,{"$nulls":3},{"v":2.25,"d":"€ 2.25"},0.21,"bindtouwklos","shutterstock_399495664"]
[{"$f":"IFERROR(INDEX(winkelwagen!I:I,MATCH(B4 & \" (\" & D4 & \" \" & E4 & \")\",winkelwagen!F:F,0)),\"\")","v":""},"bladkrans 60 cm","kransen",1,"stuks",null,1,{"$nulls":3},{"v":13.45,"d":"€ 13.45"},0.21,"bladkrans60","bladkrans"]
[{"$f":"IFERROR(INDEX(winkelwagen!I:I,MATCH(B5 & \" (\" & D5 & \" \" & E5 & \")\",winkelwagen!F:F,0)),\"\")","v":""},"bloemenband 25 mm","hulpmiddelen",27.5,"mtr",null,6,{"$nulls":3},{"v":3.7,"d":"€ 3.70"},0.21,"bloemenband25","bloemenband"]
[{"$f":"IFERROR(INDEX(winkelwagen!I:I,MATCH(B6 & \" (\" & D6 & \" \" & E6 & \")\",winkelwagen!F:F,0)),\"\")","v":""},"bloempot Ø 5 cm","pot, vaas, schaal",1,"stuks",null,12,{"$nulls":3},{"v":0.12,"d":"€ 0.12"},0.21,"bloempot5","shutterstock_76904392"]
[{"$f":"IFERROR(INDEX(winkelwagen!I:I,MATCH(B7 & \" (\" & D7 & \" \" & E7 & \")\",winkelwagen!F:F,0)),\"\")","v":""},"bloempot Ø 7 cm","pot, vaas, schaal",1,"stuks",null,12,{"$nulls":3},{"v":0.15,"d":"€ 0.15"},0.21,"bloempot7","shutterstock_76904392"]
[{"$f":"IFERROR(INDEX(winkelwagen!I:I,MATCH(B8 & \" (\" & D8 & \" \" & E8 & \")\",winkelwagen!F:F,0)),\"\")","v":""},"bloempot Ø 9 cm","pot, vaas, schaal",1,"stuks",null,12,{"$nulls":3},{"v":0.27,"d":"€ 0.27"},0.21,"bloempot9","shutterstock_76904392"]
[{"$f":"IFERROR(INDEX(winkelwagen!I:I,MATCH(B9 & \" (\" & D9 & \" \" & E9 & \")\",winkelwagen!F:F,0)),\"\")","v":""},"bloempot Ø 11 cm","pot, vaas, schaal",1,"stuks",null,12,{"$nulls":3},{"v":0.27,"d":"€ 0.27"},0.21,"bloempot11","shutterstock_76904392"]
[{"$f":"IFERROR(INDEX(winkelwagen!I:I,MATCH(B10 & \" (\" & D10 & \" \" & E10 & \")\",winkelwagen!F:F,0)),\"\")","v":""},"bloempot Ø 17 cm","pot, vaas, schaal",1,"stuks",null,12,{"$nulls":3},{"v":0.75,"d":"€ 0.75"},0.21,"bloempot17","shutterstock_76904392"]
{"$rows_left_out":20}